Reaction Details
TargetProstaglandin D2 receptor
LigandBDBM50333869
Substrate/Competitorn/a
Meas. Tech.ChEMBL_699802 (CHEMBL1645648)
Ki 104±n/a nM
Citation Gallant, MBeaulieu, CBerthelette, CColucci, JCrackower, MADalton, CDenis, DDucharme, YFriesen, RWGuay, DGervais, FGHamel, MHoule, RKrawczyk, CMKosjek, BLau, SLeblanc, YLee, EELevesque, JFMellon, CMolinaro, CMullet, WO'Neill, GPO'Shea, PSawyer, NSillaots, SSimard, DSlipetz, DStocco, RSørensen, DTruong, VLWong, EWu, JZaghdane, HWang, Z Discovery of MK-7246, a selective CRTH2 antagonist for the treatment of respiratory diseases. Bioorg Med Chem Lett21:288-93 (2010) 
 
Prostaglandin D2 receptor
Name:Prostaglandin D2 receptor
Type:Enzyme
Mol. Mass.:40288.87
Organism:Homo sapiens (Human)
Description:Q13258
Residue:359
BDBM50333869
NameBDBM50333869
Synonyms:(R)-2-(3-chloro-7-(4-fluoro-N-methylphenylsulfonamido)-6,7,8,9-tetrahydropyrido[1,2-a]indol-10-yl)acetic acid | CHEMBL1643774
TypeSmall organic molecule
Emp. Form.C21H20ClFN2O4S
Mol. Mass.450.911
SMILESCN([C@@H]1CCc2c(CC(O)=O)c3ccc(Cl)cc3n2C1)S(=O)(=O)c1ccc(F)cc1