Reaction Details
TargetPotassium voltage-gated channel subfamily H member 2
LigandBDBM50333868
Substrate/Competitorn/a
Meas. Tech.ChEMBL_699813 (CHEMBL1645659)
Ki 35000±n/a nM
Citation Gallant, MBeaulieu, CBerthelette, CColucci, JCrackower, MADalton, CDenis, DDucharme, YFriesen, RWGuay, DGervais, FGHamel, MHoule, RKrawczyk, CMKosjek, BLau, SLeblanc, YLee, EELevesque, JFMellon, CMolinaro, CMullet, WO'Neill, GPO'Shea, PSawyer, NSillaots, SSimard, DSlipetz, DStocco, RSørensen, DTruong, VLWong, EWu, JZaghdane, HWang, Z Discovery of MK-7246, a selective CRTH2 antagonist for the treatment of respiratory diseases. Bioorg Med Chem Lett21:288-93 (2010) 
 
Potassium voltage-gated channel subfamily H member 2
Name:Potassium voltage-gated channel subfamily H member 2
Type:Multi-pass membrane protein
Mol. Mass.:126672.65
Organism:Homo sapiens (Human)
Description:Q12809
Residue:1159
BDBM50333868
NameBDBM50333868
Synonyms:(R)-2-(3-fluoro-7-(4-fluoro-N-methylphenylsulfonamido)-6,7,8,9-tetrahydropyrido[1,2-a]indol-10-yl)acetic acid | CHEMBL1643773
TypeSmall organic molecule
Emp. Form.C21H20F2N2O4S
Mol. Mass.434.456
SMILESCN([C@@H]1CCc2c(CC(O)=O)c3ccc(F)cc3n2C1)S(=O)(=O)c1ccc(F)cc1