Reaction Details
TargetProstaglandin E2 receptor EP4 subtype
LigandBDBM50334129
Substrate/Competitorn/a
Meas. Tech.ChEMBL_698178 (CHEMBL1646483)
Ki 0.33±n/a nM
Citation Boyd, MJBerthelette, CChiasson, JFClark, PColucci, JDenis, DHan, YLévesque, JFMathieu, MCStocco, RTherien, ARowland, SWrona, MXu, D A novel series of potent and selective EP(4) receptor ligands: facile modulation of agonism and antagonism. Bioorg Med Chem Lett21:484-7 (2010) 
 
Prostaglandin E2 receptor EP4 subtype
Name:Prostaglandin E2 receptor EP4 subtype
Type:Enzyme
Mol. Mass.:53134.53
Organism:Homo sapiens (Human)
Description:P35408
Residue:488
BDBM50334129
NameBDBM50334129
Synonyms:(S)-4-(1-(1-(3,5-dibromobenzyl)indoline-7-carboxamido)ethyl)benzoic acid | CHEMBL1645142
TypeSmall organic molecule
Emp. Form.C25H22Br2N2O3
Mol. Mass.558.262
SMILESC[C@H](NC(=O)c1cccc2CCN(Cc3cc(Br)cc(Br)c3)c12)c1ccc(cc1)C(O)=O