Reaction Details
TargetEpidermal growth factor receptor
LigandBDBM50334224
Substrate/Competitorn/a
Meas. Tech.ChEMBL_699068 (CHEMBL1646349)
IC50 1300±n/a nM
Citation Rode, HBSos, MLGrütter, CHeynck, SSimard, JRRauh, D Synthesis and biological evaluation of 7-substituted-1-(3-bromophenylamino)isoquinoline-4-carbonitriles as inhibitors of myosin light chain kinase and epidermal growth factor receptor. Bioorg Med Chem19:429-39 (2011) 
 
Epidermal growth factor receptor
Name:Epidermal growth factor receptor
Type:Receptor Kinase Domain
Mol. Mass.:134279.59
Organism:Homo sapiens (Human)
Description:P00533
Residue:1210
BDBM50334224
NameBDBM50334224
Synonyms:CHEMBL1641992 | N-(1-(3-Bromophenylamino)-4-cyanoisoquinolin-7-yl)-3-(4-methylpiperazin-1yl)propanamide
TypeSmall organic molecule
Emp. Form.C24H25BrN6O
Mol. Mass.493.399
SMILESCN1CCN(CCC(=O)Nc2ccc3c(cnc(Nc4cccc(Br)c4)c3c2)C#N)CC1