Reaction Details
TargetSodium-dependent dopamine transporter
LigandBDBM50334920
Substrate/Competitorn/a
Meas. Tech.ChEMBL_699575 (CHEMBL1647933)
IC50 16±n/a nM
Citation Shao, LMa, JWang, FMalcolm, SCHewitt, MCCampbell, UCSpicer, NAHardy, LWSchreiber, RSpear, KLVarney, MA Discovery of 1-(3,4-dichlorophenyl)-N,N-dimethyl-1,2,3,4-tetrahydroquinolin-4-amine, a dual serotonin and dopamine reuptake inhibitor. Bioorg Med Chem Lett21:520-3 (2010) 
 
Sodium-dependent dopamine transporter
Name:Sodium-dependent dopamine transporter
Type:Multi-pass membrane protein
Mol. Mass.:68497.11
Organism:Homo sapiens (Human)
Description:Q01959
Residue:620
BDBM50334920
NameBDBM50334920
Synonyms:(R)-1-(3,4-dichlorophenyl)-N,N-dimethyl-1,2,3,4-tetrahydroquinolin-4-amine | CHEMBL1643514
TypeSmall organic molecule
Emp. Form.C17H18Cl2N2
Mol. Mass.321.244
SMILESCN(C)[C@@H]1CCN(c2ccc(Cl)c(Cl)c2)c2ccccc12