Reaction Details
TargetSphingosine 1-phosphate receptor 3
LigandBDBM50335515
Substrate/Competitorn/a
Meas. Tech.ChEMBL_702153 (CHEMBL1655490)
EC50 877±n/a nM
Citation Cee, VJFrohn, MLanman, BAGolden, JMuller, KNeira, SPickrell, AArnett, HBuys, JGore, AFiorino, MHorner, MItano, ALee, MRMcElvain, MMiddleton, SSchrag, MRivenzon-Segal, DVargas, HMXu, HXu, YZhang, XSiu, JWong, M Discovery of AMG 369, a Thiazolo[5,4-b]pyridine Agonist of S1P1 and S1P5 ACS Med Chem Lett2:107-112 (2011) 
 
Sphingosine 1-phosphate receptor 3
Name:Sphingosine 1-phosphate receptor 3
Type:G Protein-Coupled Receptor (GPCR)
Mol. Mass.:42278.13
Organism:Homo sapiens (Human)
Description:Q99500
Residue:378
BDBM50335515
NameBDBM50335515
Synonyms:1-((3-fluoro-4-(5-((S)-1-phenylethyl)thiazolo[5,4-b]pyridin-2-yl)phenyl)methyl)azetidine-3-carboxylic acid | CHEMBL1651858
TypeSmall organic molecule
Emp. Form.C25H22FN3O2S
Mol. Mass.447.524
SMILESC[C@@H](c1ccccc1)c1ccc2nc(sc2n1)-c1ccc(CN2CC(C2)C(O)=O)cc1F