Reaction Details
TargetSphingosine 1-phosphate receptor 3
LigandBDBM50335517
Substrate/Competitorn/a
Meas. Tech.ChEMBL_702153 (CHEMBL1655490)
EC50 478±n/a nM
Citation Cee, VJFrohn, MLanman, BAGolden, JMuller, KNeira, SPickrell, AArnett, HBuys, JGore, AFiorino, MHorner, MItano, ALee, MRMcElvain, MMiddleton, SSchrag, MRivenzon-Segal, DVargas, HMXu, HXu, YZhang, XSiu, JWong, M Discovery of AMG 369, a Thiazolo[5,4-b]pyridine Agonist of S1P1 and S1P5 ACS Med Chem Lett2:107-112 (2011) 
 
Sphingosine 1-phosphate receptor 3
Name:Sphingosine 1-phosphate receptor 3
Type:G Protein-Coupled Receptor (GPCR)
Mol. Mass.:42278.13
Organism:Homo sapiens (Human)
Description:Q99500
Residue:378
BDBM50335517
NameBDBM50335517
Synonyms:1-(4-(5-benzylthiazolo[5,4-b]pyridin-2-yl)-3-fluorobenzyl)azetidine-3-carboxylic acid | CHEMBL1651857
TypeSmall organic molecule
Emp. Form.C24H20FN3O2S
Mol. Mass.433.498
SMILESOC(=O)C1CN(Cc2ccc(-c3nc4ccc(Cc5ccccc5)nc4s3)c(F)c2)C1