Reaction Details
TargetSphingosine 1-phosphate receptor 5
LigandBDBM50335514
Substrate/Competitorn/a
Meas. Tech.ChEMBL_702156 (CHEMBL1655493)
EC50 29±n/a nM
Citation Cee, VJFrohn, MLanman, BAGolden, JMuller, KNeira, SPickrell, AArnett, HBuys, JGore, AFiorino, MHorner, MItano, ALee, MRMcElvain, MMiddleton, SSchrag, MRivenzon-Segal, DVargas, HMXu, HXu, YZhang, XSiu, JWong, M Discovery of AMG 369, a Thiazolo[5,4-b]pyridine Agonist of S1P1 and S1P5 ACS Med Chem Lett2:107-112 (2011) 
 
Sphingosine 1-phosphate receptor 5
Name:Sphingosine 1-phosphate receptor 5
Type:G Protein-Coupled Receptor (GPCR)
Mol. Mass.:41796.42
Organism:Homo sapiens (Human)
Description:n/a
Residue:398
BDBM50335514
NameBDBM50335514
Synonyms:1-((3-fluoro-4-(5-(1-phenylcyclopropyl)thiazolo[5,4-b]pyridin-2-yl)phenyl)methyl)azetidine-3-carboxylic acid | CHEMBL1651861
TypeSmall organic molecule
Emp. Form.C26H22FN3O2S
Mol. Mass.459.535
SMILESOC(=O)C1CN(Cc2ccc(-c3nc4ccc(nc4s3)C3(CC3)c3ccccc3)c(F)c2)C1