Reaction Details
TargetMultidrug resistance protein CDR1
LigandBDBM50059989
Substrate/Competitorn/a
Meas. Tech.ChEMBL_708756 (CHEMBL1667226)
IC50 40000±n/a nM
Citation Sharma, MManoharlal, RShukla, SPuri, NPrasad, TAmbudkar, SVPrasad, R Curcumin modulates efflux mediated by yeast ABC multidrug transporters and is synergistic with antifungals. Antimicrob Agents Chemother53:3256-65 (2009) 
 
Multidrug resistance protein CDR1
Name:Multidrug resistance protein CDR1
Type:PROTEIN
Mol. Mass.:169942.67
Organism:Candida albicans
Description:ChEMBL_708756
Residue:1501
BDBM50059989
NameBDBM50059989
Synonyms:(1E,4Z,6E)-5-Hydroxy-1,7-bis-(4-hydroxy-phenyl)-hepta-1,4,6-trien-3-one 1,7-bis(4-hydroxyphenyl)-1,6-heptadiene-3,5-dione 5-Hydroxy-1,7-bis(4-hydroxyphenyl)hepta-1,4,6-trien-3-one CHEMBL105350 bis-demethoxycurcumin curcumin III
TypeSmall organic molecule
Emp. Form.C19H16O4
Mol. Mass.308.3279
SMILESOc1ccc(C=CC(=O)CC(=O)C=Cc2ccc(O)cc2)cc1