Reaction Details
TargetAurora kinase A
LigandBDBM50318603
Substrate/Competitorn/a
Meas. Tech.ChEMBL_715420 (CHEMBL1664805)
IC50 10±n/a nM
Citation Lan, PChen, WNChen, WM Molecular modeling studies on imidazo[4,5-b]pyridine derivatives as Aurora A kinase inhibitors using 3D-QSAR and docking approaches. Eur J Med Chem46:77-94 (2010) 
 
Aurora kinase A
Name:Aurora kinase A
Type:Serine/threonine-protein kinase
Mol. Mass.:45830.98
Organism:Homo sapiens (Human)
Description:O14965
Residue:403
BDBM50318603
NameBDBM50318603
Synonyms:3-((4-(6-Bromo-2-(4-(piperazin-1-ylmethyl)phenyl)-3H-imidazo[4,5-b]pyridin-7-yl)piperazin-1-yl)methyl)-5-methylisoxazole | CHEMBL1085607
TypeSmall organic molecule
Emp. Form.C26H31BrN8O
Mol. Mass.551.481
SMILESCc1cc(CN2CCN(CC2)c2c(Br)cnc3nc([nH]c23)-c2ccc(CN3CCNCC3)cc2)no1