Reaction Details
TargetAurora kinase A
LigandBDBM50335607
Substrate/Competitorn/a
Meas. Tech.ChEMBL_715420 (CHEMBL1664805)
IC50 14±n/a nM
Citation Lan, PChen, WNChen, WM Molecular modeling studies on imidazo[4,5-b]pyridine derivatives as Aurora A kinase inhibitors using 3D-QSAR and docking approaches. Eur J Med Chem46:77-94 (2010) 
 
Aurora kinase A
Name:Aurora kinase A
Type:Serine/threonine-protein kinase
Mol. Mass.:45830.98
Organism:Homo sapiens (Human)
Description:O14965
Residue:403
BDBM50335607
NameBDBM50335607
Synonyms:1-(4'-(6-bromo-7-(4-((5-methylisoxazol-3-yl)methyl)piperazin-1-yl)-3H-imidazo[4,5-b]pyridin-2-yl)biphenyl-3-yl)ethanone | CHEMBL1651454
TypeSmall organic molecule
Emp. Form.C29H27BrN6O2
Mol. Mass.571.468
SMILESCC(=O)c1cccc(c1)-c1ccc(cc1)-c1nc2ncc(Br)c(N3CCN(Cc4cc(C)on4)CC3)c2[nH]1