Reaction Details
TargetAurora kinase A
LigandBDBM50318605
Substrate/Competitorn/a
Meas. Tech.ChEMBL_715420 (CHEMBL1664805)
IC50 10±n/a nM
Citation Lan, PChen, WNChen, WM Molecular modeling studies on imidazo[4,5-b]pyridine derivatives as Aurora A kinase inhibitors using 3D-QSAR and docking approaches. Eur J Med Chem46:77-94 (2010) 
 
Aurora kinase A
Name:Aurora kinase A
Type:Serine/threonine-protein kinase
Mol. Mass.:45830.98
Organism:Homo sapiens (Human)
Description:O14965
Residue:403
BDBM50318605
NameBDBM50318605
Synonyms:(4-(6-Bromo-7-(4-((5-methylisoxazol-3-yl)methyl)piperazin-1-yl)-3H-imidazo[4,5-b]pyridin-2-yl)phenyl)methanamine | CHEMBL1082597
TypeSmall organic molecule
Emp. Form.C22H24BrN7O
Mol. Mass.482.376
SMILESCc1cc(CN2CCN(CC2)c2c(Br)cnc3nc([nH]c23)-c2ccc(CN)cc2)no1