Reaction Details
TargetAurora kinase A
LigandBDBM50224731
Substrate/Competitorn/a
Meas. Tech.ChEMBL_715420 (CHEMBL1664805)
IC50 570±n/a nM
Citation Lan, PChen, WNChen, WM Molecular modeling studies on imidazo[4,5-b]pyridine derivatives as Aurora A kinase inhibitors using 3D-QSAR and docking approaches. Eur J Med Chem46:77-94 (2010) 
 
Aurora kinase A
Name:Aurora kinase A
Type:Serine/threonine-protein kinase
Mol. Mass.:45830.98
Organism:Homo sapiens (Human)
Description:O14965
Residue:403
BDBM50224731
NameBDBM50224731
Synonyms:4-(6-chloro-3H-imidazo[4,5-b]pyridin-2-yl)-N,N-dimethylbenzenamine | CHEMBL236694
TypeSmall organic molecule
Emp. Form.C14H13ClN4
Mol. Mass.272.733
SMILESCN(C)c1ccc(cc1)-c1nc2ncc(Cl)cc2[nH]1