Reaction Details
TargetAurora kinase A
LigandBDBM50318572
Substrate/Competitorn/a
Meas. Tech.ChEMBL_715420 (CHEMBL1664805)
IC50 16±n/a nM
Citation Lan, PChen, WNChen, WM Molecular modeling studies on imidazo[4,5-b]pyridine derivatives as Aurora A kinase inhibitors using 3D-QSAR and docking approaches. Eur J Med Chem46:77-94 (2010) 
 
Aurora kinase A
Name:Aurora kinase A
Type:Serine/threonine-protein kinase
Mol. Mass.:45830.98
Organism:Homo sapiens (Human)
Description:O14965
Residue:403
BDBM50318572
NameBDBM50318572
Synonyms:2-{4-[6-Bromo-2-(4-dimethylaminomethylphenyl)-3H-imidazo[4,5-b]pyridin-7-yl]-piperazin-1-yl}-N-thiazol-2-yl-acetamide | CHEMBL1082507
TypeSmall organic molecule
Emp. Form.C24H27BrN8OS
Mol. Mass.555.493
SMILESCN(C)Cc1ccc(cc1)-c1nc2ncc(Br)c(N3CCN(CC(=O)Nc4nccs4)CC3)c2[nH]1