Reaction Details
TargetAurora kinase A
LigandBDBM50318583
Substrate/Competitorn/a
Meas. Tech.ChEMBL_715420 (CHEMBL1664805)
IC50 210±n/a nM
Citation Lan, PChen, WNChen, WM Molecular modeling studies on imidazo[4,5-b]pyridine derivatives as Aurora A kinase inhibitors using 3D-QSAR and docking approaches. Eur J Med Chem46:77-94 (2010) 
 
Aurora kinase A
Name:Aurora kinase A
Type:Serine/threonine-protein kinase
Mol. Mass.:45830.98
Organism:Homo sapiens (Human)
Description:O14965
Residue:403
BDBM50318583
NameBDBM50318583
Synonyms:4-(6-Bromo-7-(4-isobutylpiperazin-1-yl)-3H-imidazo[4,5-b]pyridin-2-yl)-N,Ndimethylaniline | CHEMBL1085136
TypeSmall organic molecule
Emp. Form.C22H29BrN6
Mol. Mass.457.41
SMILESCC(C)CN1CCN(CC1)c1c(Br)cnc2nc([nH]c12)-c1ccc(cc1)N(C)C