Reaction Details
TargetAurora kinase A
LigandBDBM50335616
Substrate/Competitorn/a
Meas. Tech.ChEMBL_715420 (CHEMBL1664805)
IC50 81±n/a nM
Citation Lan, PChen, WNChen, WM Molecular modeling studies on imidazo[4,5-b]pyridine derivatives as Aurora A kinase inhibitors using 3D-QSAR and docking approaches. Eur J Med Chem46:77-94 (2010) 
 
Aurora kinase A
Name:Aurora kinase A
Type:Serine/threonine-protein kinase
Mol. Mass.:45830.98
Organism:Homo sapiens (Human)
Description:O14965
Residue:403
BDBM50335616
NameBDBM50335616
Synonyms:4-((4-(6-bromo-2-(4-methoxyphenyl)-3H-imidazo[4,5-b]pyridin-7-yl)piperazin-1-yl)methyl)-2-isopropyloxazole | CHEMBL1651452
TypeSmall organic molecule
Emp. Form.C24H27BrN6O2
Mol. Mass.511.414
SMILESCOc1ccc(cc1)-c1nc2ncc(Br)c(N3CCN(Cc4coc(n4)C(C)C)CC3)c2[nH]1