Reaction Details
TargetAurora kinase A
LigandBDBM50318599
Substrate/Competitorn/a
Meas. Tech.ChEMBL_715420 (CHEMBL1664805)
IC50 32±n/a nM
Citation Lan, PChen, WNChen, WM Molecular modeling studies on imidazo[4,5-b]pyridine derivatives as Aurora A kinase inhibitors using 3D-QSAR and docking approaches. Eur J Med Chem46:77-94 (2010) 
 
Aurora kinase A
Name:Aurora kinase A
Type:Serine/threonine-protein kinase
Mol. Mass.:45830.98
Organism:Homo sapiens (Human)
Description:O14965
Residue:403
BDBM50318599
NameBDBM50318599
Synonyms:6-Bromo-2-(4-methoxyphenyl)-7-(4-((1-methyl-1H-imidazol-2-yl)methyl)piperazin-1-yl)-3H-imidazo[4,5-b]pyridine | CHEMBL1084888
TypeSmall organic molecule
Emp. Form.C22H24BrN7O
Mol. Mass.482.376
SMILESCOc1ccc(cc1)-c1nc2ncc(Br)c(N3CCN(Cc4nccn4C)CC3)c2[nH]1