Reaction Details
TargetAurora kinase A
LigandBDBM50335617
Substrate/Competitorn/a
Meas. Tech.ChEMBL_715420 (CHEMBL1664805)
IC50 5±n/a nM
Citation Lan, PChen, WNChen, WM Molecular modeling studies on imidazo[4,5-b]pyridine derivatives as Aurora A kinase inhibitors using 3D-QSAR and docking approaches. Eur J Med Chem46:77-94 (2010) 
 
Aurora kinase A
Name:Aurora kinase A
Type:Serine/threonine-protein kinase
Mol. Mass.:45830.98
Organism:Homo sapiens (Human)
Description:O14965
Residue:403
BDBM50335617
NameBDBM50335617
Synonyms:4-(4-(6-bromo-7-(4-(pyridin-4-ylmethyl)piperazin-1-yl)-3H-imidazo[4,5-b]pyridin-2-yl)benzyl)morpholine | CHEMBL1651453
TypeSmall organic molecule
Emp. Form.C27H30BrN7O
Mol. Mass.548.477
SMILESBrc1cnc2nc([nH]c2c1N1CCN(Cc2ccncc2)CC1)-c1ccc(CN2CCOCC2)cc1