Reaction Details
TargetSerine/threonine-protein kinase Chk2
LigandBDBM50335681
Substrate/Competitorn/a
Meas. Tech.ChEMBL_714871 (CHEMBL1663817)
IC50 11±n/a nM
Citation Caldwell, JJWelsh, EJMatijssen, CAnderson, VEAntoni, LBoxall, KUrban, FHayes, ARaynaud, FIRigoreau, LJRaynham, TAherne, GWPearl, LHOliver, AWGarrett, MDCollins, I Structure-based design of potent and selective 2-(quinazolin-2-yl)phenol inhibitors of checkpoint kinase 2. J Med Chem54:580-90 (2011) 
 
Serine/threonine-protein kinase Chk2
Name:Serine/threonine-protein kinase Chk2
Type:Protein
Mol. Mass.:60908.59
Organism:Homo sapiens (Human)
Description:O96017
Residue:543
BDBM50335681
NameBDBM50335681
Synonyms:(S)-4-fluoro-2-(7-(2-methoxyethoxy)-4-(pyrrolidin-3-ylamino)quinazolin-2-yl)phenol | CHEMBL1650126
TypeSmall organic molecule
Emp. Form.C21H23FN4O3
Mol. Mass.398.4307
SMILESCOCCOc1ccc2c(N[C@H]3CCNC3)nc(nc2c1)-c1cc(F)ccc1O