Reaction Details
TargetSerine/threonine-protein kinase Chk2
LigandBDBM50335685
Substrate/Competitorn/a
Meas. Tech.ChEMBL_714871 (CHEMBL1663817)
IC50 11±n/a nM
Citation Caldwell, JJWelsh, EJMatijssen, CAnderson, VEAntoni, LBoxall, KUrban, FHayes, ARaynaud, FIRigoreau, LJRaynham, TAherne, GWPearl, LHOliver, AWGarrett, MDCollins, I Structure-based design of potent and selective 2-(quinazolin-2-yl)phenol inhibitors of checkpoint kinase 2. J Med Chem54:580-90 (2011) 
 
Serine/threonine-protein kinase Chk2
Name:Serine/threonine-protein kinase Chk2
Type:Protein
Mol. Mass.:60908.59
Organism:Homo sapiens (Human)
Description:O96017
Residue:543
BDBM50335685
NameBDBM50335685
Synonyms:4-fluoro-2-(4-((3S,4R)-4-(hydroxymethyl)pyrrolidin-3-ylamino)-6,7-dimethoxyquinazolin-2-yl)phenol | CHEMBL1650129
TypeSmall organic molecule
Emp. Form.C21H23FN4O4
Mol. Mass.414.4301
SMILESCOc1cc2nc(nc(N[C@@H]3CNC[C@H]3CO)c2cc1OC)-c1cc(F)ccc1O