Reaction Details
TargetcAMP-specific 3',5'-cyclic phosphodiesterase 4B
LigandBDBM50335827
Substrate/Competitorn/a
Meas. Tech.ChEMBL_715333 (CHEMBL1664620)
IC50>50000±n/a nM
Citation Mohamed, HAGirgis, NMWilcken, RBauer, MRTinsley, HNGary, BDPiazza, GABoeckler, FMAbadi, AH Synthesis and molecular modeling of novel tetrahydro-ß-carboline derivatives with phosphodiesterase 5 inhibitory and anticancer properties. J Med Chem54:495-509 (2011) 
 
cAMP-specific 3',5'-cyclic phosphodiesterase 4B
Name:cAMP-specific 3',5'-cyclic phosphodiesterase 4B
Type:Protein
Mol. Mass.:83318.87
Organism:Homo sapiens (Human)
Description:Q07343
Residue:736
BDBM50335827
NameBDBM50335827
Synonyms:(6R,12aR)6-(2,4-Dichlorophenyl)-2-ethyl-2,3,6,7,12,12a-hexahydropyrazino[1',2':1,6]pyrido[3,4-b]indole-1,4-dione | CHEMBL1650866
TypeSmall organic molecule
Emp. Form.C22H19Cl2N3O2
Mol. Mass.428.311
SMILESCCN1CC(=O)N2[C@H](Cc3c([nH]c4ccccc34)[C@H]2c2ccc(Cl)cc2Cl)C1=O