Reaction Details
TargetMineralocorticoid receptor
LigandBDBM50336275
Substrate/Competitorn/a
Meas. Tech.ChEMBL_716553 (CHEMBL1670277)
IC50 580±n/a nM
Citation Jiang, CSZhou, RGong, JXChen, LLKurtán, TShen, XGuo, YW Synthesis, modification, and evaluation of (R)-de-O-methyllasiodiplodin and analogs as nonsteroidal antagonists of mineralocorticoid receptor. Bioorg Med Chem Lett21:1171-5 (2011) 
 
Mineralocorticoid receptor
Name:Mineralocorticoid receptor
Type:Enzyme Catalytic Domain
Mol. Mass.:106748.15
Organism:RAT
Description:mineralocorticoid 0 RAT::P22199
Residue:981
BDBM50336275
NameBDBM50336275
Synonyms:1-oxo-1,3,4,5,6,7,8,9-octahydrobenzo[c][1]oxacycloundecine-11,13-diyl diacetate | CHEMBL1669770
TypeSmall organic molecule
Emp. Form.C18H22O6
Mol. Mass.334.3637
SMILESCC(=O)Oc1cc2CCCCCCCOC(=O)c2c(OC(C)=O)c1