Reaction Details
TargetMineralocorticoid receptor
LigandBDBM50336274
Substrate/Competitorn/a
Meas. Tech.ChEMBL_716553 (CHEMBL1670277)
IC50 2900±n/a nM
Citation Jiang, CSZhou, RGong, JXChen, LLKurtán, TShen, XGuo, YW Synthesis, modification, and evaluation of (R)-de-O-methyllasiodiplodin and analogs as nonsteroidal antagonists of mineralocorticoid receptor. Bioorg Med Chem Lett21:1171-5 (2011) 
 
Mineralocorticoid receptor
Name:Mineralocorticoid receptor
Type:Enzyme Catalytic Domain
Mol. Mass.:106748.15
Organism:RAT
Description:mineralocorticoid 0 RAT::P22199
Residue:981
BDBM50336274
NameBDBM50336274
Synonyms:1-oxo-3,4,5,6,7,8,9,10,11,12-decahydro-1H-benzo[c][1]oxacyclotetradecine-14,16-diyl diacetate | CHEMBL1669776
TypeSmall organic molecule
Emp. Form.C21H28O6
Mol. Mass.376.4434
SMILESCC(=O)Oc1cc2CCCCCCCCCCOC(=O)c2c(OC(C)=O)c1