Reaction Details
TargetSerine/threonine-protein kinase mTOR
LigandBDBM50336404
Substrate/Competitorn/a
Meas. Tech.ChEMBL_716817 (CHEMBL1670739)
Ki 3±n/a nM
Citation Liu, KKHuang, XBagrodia, SChen, JHGreasley, SCheng, HSun, SKnighton, DRodgers, CRafidi, KZou, AXiao, JYan, S Quinazolines with intra-molecular hydrogen bonding scaffold (iMHBS) as PI3K/mTOR dual inhibitors. Bioorg Med Chem Lett21:1270-4 (2011) 
 
Serine/threonine-protein kinase mTOR
Name:Serine/threonine-protein kinase mTOR
Type:Rapamycin target protein
Mol. Mass.:288917.12
Organism:Homo sapiens (Human)
Description:P42345
Residue:2549
BDBM50336404
NameBDBM50336404
Synonyms:4-amino-2,6-dimethyl-N-(1H-pyrazol-5-yl)quinazoline-8-carboxamide | CHEMBL1668266
TypeSmall organic molecule
Emp. Form.C14H14N6O
Mol. Mass.282.3006
SMILESCc1cc(C(=O)Nc2ccn[nH]2)c2nc(C)nc(N)c2c1