Reaction Details
TargetCathepsin L2
LigandBDBM50336478
Substrate/Competitorn/a
Meas. Tech.ChEMBL_716901 (CHEMBL1670880)
Ki 1100±n/a nM
Citation Severino, RPGuido, RVMarques, EFBrömme, Dda Silva, MFFernandes, JBAndricopulo, ADVieira, PC Acridone alkaloids as potent inhibitors of cathepsin V. Bioorg Med Chem19:1477-81 (2011) 
 
Cathepsin L2
Name:Cathepsin L2
Type:Enzyme
Mol. Mass.:37341.06
Organism:Homo sapiens (Human)
Description:O60911
Residue:334
BDBM50336478
NameBDBM50336478
Synonyms:1,3,5-trihydroxy-4-methoxy-2-(3-methylbut-2-enyl)-10-methyl-9-acridone glycocitrine-IV
TypeSmall organic molecule
Emp. Form.C20H21NO5
Mol. Mass.355.3844
SMILES[#6]-[#8]-c1c(-[#8])c(-[#6]\[#6]=[#6](\[#6])-[#6])c(-[#8])c2c1n(-[#6])c1c(-[#8])cccc1c2=O