Reaction Details
TargetCathepsin L2
LigandBDBM50336486
Substrate/Competitorn/a
Meas. Tech.ChEMBL_716901 (CHEMBL1670880)
Ki 1700±n/a nM
Citation Severino, RPGuido, RVMarques, EFBrömme, Dda Silva, MFFernandes, JBAndricopulo, ADVieira, PC Acridone alkaloids as potent inhibitors of cathepsin V. Bioorg Med Chem19:1477-81 (2011) 
 
Cathepsin L2
Name:Cathepsin L2
Type:Enzyme
Mol. Mass.:37341.06
Organism:Homo sapiens (Human)
Description:O60911
Residue:334
BDBM50336486
NameBDBM50336486
Synonyms:3,4-dihydro-3,5,8-trihydroxy-6-methoxy-2,2,7-trimethyl-2Hpyrano[2,3-a]acridin-12(7H)-one | CHEMBL1668602
TypeSmall organic molecule
Emp. Form.C20H21NO6
Mol. Mass.371.3838
SMILESCOc1c(O)c2CC(O)C(C)(C)Oc2c2c1n(C)c1c(O)cccc1c2=O