Reaction Details
TargetCarbonic anhydrase 9
LigandBDBM50146462
Substrate/Competitorn/a
Meas. Tech.ChEMBL_716904 (CHEMBL1670883)
Ki>1000000±n/a nM
Citation Durdagi, SSentürk, MEkinci, DBalaydin, HTGöksu, SKüfrevioglu, ÖIInnocenti, AScozzafava, ASupuran, CT Kinetic and docking studies of phenol-based inhibitors of carbonic anhydrase isoforms I, II, IX and XII evidence a new binding mode within the enzyme active site. Bioorg Med Chem19:1381-9 (2011) 
 
Carbonic anhydrase 9
Name:Carbonic anhydrase 9
Type:Enzyme
Mol. Mass.:49669.03
Organism:Homo sapiens (Human)
Description:Catalytic domain of human cloned isozyme was used in the assay
Residue:459
BDBM50146462
NameBDBM50146462
Synonyms:(2E)-3-(2-hydroxyphenyl)-2-propenoic acid (2E)-3-(2-hydroxyphenyl)prop-2-enoic acid (7) (E)-3-(2-hydroxyphenyl)-2-propenoic acid CHEMBL52564 o-hydroxy-trans-cinnamic acid trans-o-hydroxycinnamic acid
TypeSmall organic molecule
Emp. Form.C9H8O3
Mol. Mass.164.158
SMILESOC(=O)\C=C\c1ccccc1O