Reaction Details
TargetCarbonic anhydrase 12
LigandBDBM50336487
Substrate/Competitorn/a
Meas. Tech.ChEMBL_716905 (CHEMBL1670884)
Ki 6700±n/a nM
Citation Durdagi, SSentürk, MEkinci, DBalaydin, HTGöksu, SKüfrevioglu, ÖIInnocenti, AScozzafava, ASupuran, CT Kinetic and docking studies of phenol-based inhibitors of carbonic anhydrase isoforms I, II, IX and XII evidence a new binding mode within the enzyme active site. Bioorg Med Chem19:1381-9 (2011) 
 
Carbonic anhydrase 12
Name:Carbonic anhydrase 12
Type:Enzyme
Mol. Mass.:39456.00
Organism:Homo sapiens (Human)
Description:Catalytic domain of human cloned isozyme was used in the assay
Residue:354
BDBM50336487
NameBDBM50336487
Synonyms:3,4-Dimethoxy-benzoic acid CHEMBL118903
TypeSmall organic molecule
Emp. Form.C9H10O4
Mol. Mass.182.1733
SMILESCOc1ccc(cc1OC)C(O)=O