Reaction Details
TargetCarbonic anhydrase 1
LigandBDBM10874
Substrate/Competitorn/a
Meas. Tech.ChEMBL_726066 (CHEMBL1678662)
pH7.5±n/a
Ki 95±n/a nM
Commentsextracted
Citation Joseph, POuahrani-Bettache, SMontero, JLNishimori, IMinakuchi, TVullo, DScozzafava, AWinum, JYKöhler, SSupuran, CT A newß-carbonic anhydrase from Brucella suis, its cloning, characterization, and inhibition with sulfonamides and sulfamates, leading to impaired pathogen growth. Bioorg Med Chem19:1172-8 (2011) 
 
Carbonic anhydrase 1
Name:Carbonic anhydrase 1
Type:Enzyme
Mol. Mass.:28873.37
Organism:Homo sapiens (Human)
Description:P00915
Residue:261
BDBM10874
NameBDBM10874
Synonyms:6-hydroxy-1,3-benzothiazole-2-sulfonamide aromatic/heteroaromatic sulfonamide 19
TypeSmall organic molecule
Emp. Form.C7H6N2O3S2
Mol. Mass.230.264
SMILESNS(=O)(=O)c1nc2ccc(O)cc2s1