Reaction Details
TargetCarbonic anhydrase 1
LigandBDBM50314769
Substrate/Competitorn/a
Meas. Tech.ChEMBL_726066 (CHEMBL1678662)
pH7.5±n/a
Ki 1000±n/a nM
Commentsextracted
Citation Joseph, POuahrani-Bettache, SMontero, JLNishimori, IMinakuchi, TVullo, DScozzafava, AWinum, JYKöhler, SSupuran, CT A newß-carbonic anhydrase from Brucella suis, its cloning, characterization, and inhibition with sulfonamides and sulfamates, leading to impaired pathogen growth. Bioorg Med Chem19:1172-8 (2011) 
 
Carbonic anhydrase 1
Name:Carbonic anhydrase 1
Type:Enzyme
Mol. Mass.:28873.37
Organism:Homo sapiens (Human)
Description:P00915
Residue:261
BDBM50314769
NameBDBM50314769
Synonyms:4-((2R,3R,4S,5R,6R)-3,4,5-trihydroxy-6-(hydroxymethyl)tetrahydro-2H-pyran-2-ylamino)benzenesulfonamide | CHEMBL1090523
TypeSmall organic molecule
Emp. Form.C12H18N2O7S
Mol. Mass.334.346
SMILESNS(=O)(=O)c1ccc(N[C@@H]2O[C@H](CO)[C@H](O)[C@H](O)[C@H]2O)cc1