Reaction Details
TargetCarbonic anhydrase 2
LigandBDBM50098102
Substrate/Competitorn/a
Meas. Tech.ChEMBL_726067 (CHEMBL1678663)
pH7.5±n/a
Ki 1.1±n/a nM
Commentsextracted
Citation Joseph, POuahrani-Bettache, SMontero, JLNishimori, IMinakuchi, TVullo, DScozzafava, AWinum, JYKöhler, SSupuran, CT A newß-carbonic anhydrase from Brucella suis, its cloning, characterization, and inhibition with sulfonamides and sulfamates, leading to impaired pathogen growth. Bioorg Med Chem19:1172-8 (2011) 
 
Carbonic anhydrase 2
Name:Carbonic anhydrase 2
Type:Enzyme
Mol. Mass.:29250.71
Organism:Homo sapiens (Human)
Description:P00918
Residue:260
BDBM50098102
NameBDBM50098102
Synonyms:CHEMBL23350 | Sulfamic acid 4-chloro-phenyl ester
TypeSmall organic molecule
Emp. Form.C6H6ClNO3S
Mol. Mass.207.635
SMILESNS(=O)(=O)Oc1ccc(Cl)cc1