Reaction Details
TargetCarbonic anhydrase 2
LigandBDBM33281
Substrate/Competitorn/a
Meas. Tech.ChEMBL_726067 (CHEMBL1678663)
pH7.5±n/a
Ki 14.6±n/a nM
Commentsextracted
Citation Joseph, POuahrani-Bettache, SMontero, JLNishimori, IMinakuchi, TVullo, DScozzafava, AWinum, JYKöhler, SSupuran, CT A newß-carbonic anhydrase from Brucella suis, its cloning, characterization, and inhibition with sulfonamides and sulfamates, leading to impaired pathogen growth. Bioorg Med Chem19:1172-8 (2011) 
 
Carbonic anhydrase 2
Name:Carbonic anhydrase 2
Type:Enzyme
Mol. Mass.:29250.71
Organism:Homo sapiens (Human)
Description:P00918
Residue:260
BDBM33281
NameBDBM33281
Synonyms:CHEMBL182455 | bis-sulfamate, 3
TypeSmall organic molecule
Emp. Form.C8H20N2O6S2
Mol. Mass.304.384
SMILESNS(=O)(=O)OCCCCCCCCOS(N)(=O)=O