Reaction Details
TargetDisintegrin and metalloproteinase domain-containing protein 17
LigandBDBM50337724
Substrate/Competitorn/a
Meas. Tech.ChEMBL_726752 (CHEMBL1686226)
IC50 230±n/a nM
Citation De Savi, CPape, ACumming, JGTing, ASmith, PDBurrows, JNMills, MDavies, CLamont, SMilne, DCook, CMoore, PSawyer, YGerhardt, S The design and synthesis of novel N-hydroxyformamide inhibitors of ADAM-TS4 for the treatment of osteoarthritis. Bioorg Med Chem Lett21:1376-81 (2011) 
 
Disintegrin and metalloproteinase domain-containing protein 17
Name:Disintegrin and metalloproteinase domain-containing protein 17
Type:Enzyme
Mol. Mass.:93007.89
Organism:Homo sapiens (Human)
Description:
Residue:824
BDBM50337724
NameBDBM50337724
Synonyms:CHEMBL1683458 US10322143, Compound 8k
TypeSmall organic molecule
Emp. Form.C25H36FN5O4S
Mol. Mass.521.648
SMILESC[C@@H](C[C@@](C)(CS(=O)(=O)N1CCC(CCc2cc(C)ncc2C)CC1)N(O)C=O)c1ncc(F)cn1