Reaction Details
TargetCollagenase 3
LigandBDBM50337732
Substrate/Competitorn/a
Meas. Tech.ChEMBL_728836 (CHEMBL1686371)
IC50 570±n/a nM
Citation De Savi, CPape, ACumming, JGTing, ASmith, PDBurrows, JNMills, MDavies, CLamont, SMilne, DCook, CMoore, PSawyer, YGerhardt, S The design and synthesis of novel N-hydroxyformamide inhibitors of ADAM-TS4 for the treatment of osteoarthritis. Bioorg Med Chem Lett21:1376-81 (2011) 
 
Collagenase 3
Name:Collagenase 3
Type:Enzyme
Mol. Mass.:53808.06
Organism:Homo sapiens (Human)
Description:P45452
Residue:471
BDBM50337732
NameBDBM50337732
Synonyms:CHEMBL1683452 US10322143, Compound 8d
TypeSmall organic molecule
Emp. Form.C24H31ClF2N4O4S
Mol. Mass.545.042
SMILESC[C@@H](C[C@@](C)(CS(=O)(=O)N1CCC(CCc2cc(F)ccc2Cl)CC1)N(O)C=O)c1ncc(F)cn1