Reaction Details
Target72 kDa type IV collagenase
LigandBDBM50337722
Substrate/Competitorn/a
Meas. Tech.ChEMBL_726751 (CHEMBL1686225)
IC50 2400±n/a nM
Citation De Savi, CPape, ACumming, JGTing, ASmith, PDBurrows, JNMills, MDavies, CLamont, SMilne, DCook, CMoore, PSawyer, YGerhardt, S The design and synthesis of novel N-hydroxyformamide inhibitors of ADAM-TS4 for the treatment of osteoarthritis. Bioorg Med Chem Lett21:1376-81 (2011) 
 
72 kDa type IV collagenase
Name:72 kDa type IV collagenase
Type:Enzyme
Mol. Mass.:73870.36
Organism:Homo sapiens (Human)
Description: P08253
Residue:660
BDBM50337722
NameBDBM50337722
Synonyms:CHEMBL1683460 | N-((2S,4S)-1-(4-(2-(3,5-dimethylisothiazol-4-yl)ethyl)piperidin-1-ylsulfonyl)-4-(5-fluoropyrimidin-2-yl)-2-methylpentan-2-yl)-N-hydroxyformamide
TypeSmall organic molecule
Emp. Form.C23H34FN5O4S2
Mol. Mass.527.676
SMILESC[C@@H](C[C@@](C)(CS(=O)(=O)N1CCC(CCc2c(C)nsc2C)CC1)N(O)C=O)c1ncc(F)cn1