Reaction Details
TargetCollagenase 3
LigandBDBM50337735
Substrate/Competitorn/a
Meas. Tech.ChEMBL_728836 (CHEMBL1686371)
IC50>8100±n/a nM
Citation De Savi, CPape, ACumming, JGTing, ASmith, PDBurrows, JNMills, MDavies, CLamont, SMilne, DCook, CMoore, PSawyer, YGerhardt, S The design and synthesis of novel N-hydroxyformamide inhibitors of ADAM-TS4 for the treatment of osteoarthritis. Bioorg Med Chem Lett21:1376-81 (2011) 
 
Collagenase 3
Name:Collagenase 3
Type:Enzyme
Mol. Mass.:53808.06
Organism:Homo sapiens (Human)
Description:P45452
Residue:471
BDBM50337735
NameBDBM50337735
Synonyms:CHEMBL1615187 US10322143, Compound 8m
TypeSmall organic molecule
Emp. Form.C23H34FN5O5S
Mol. Mass.511.61
SMILESC[C@@H](C[C@@](C)(CS(=O)(=O)N1CCC(CCc2c(C)noc2C)CC1)N(O)C=O)c1ncc(F)cn1