Reaction Details
TargetSodium-dependent noradrenaline transporter
LigandBDBM50337822
Substrate/Competitorn/a
Meas. Tech.ChEMBL_726927 (CHEMBL1686716)
IC50 790±n/a nM
Citation Shao, LHewitt, MCWang, FMalcolm, SCMa, JCampbell, JECampbell, UCEngel, SRSpicer, NAHardy, LWSchreiber, RSpear, KLVarney, MA Discovery of N-methyl-1-(1-phenylcyclohexyl)methanamine, a novel triple serotonin, norepinephrine, and dopamine reuptake inhibitor. Bioorg Med Chem Lett21:1438-41 (2011) 
 
Sodium-dependent noradrenaline transporter
Name:Sodium-dependent noradrenaline transporter
Type:Multi-pass membrane protein
Mol. Mass.:69337.72
Organism:Homo sapiens (Human)
Description:P23975
Residue:617
BDBM50337822
NameBDBM50337822
Synonyms:4-((1-(3,4-dichlorophenyl)cyclohexyl)methyl)morpholine US10562878, Compound 110
TypeSmall organic molecule
Emp. Form.C17H23Cl2NO
Mol. Mass.328.277
SMILESClc1ccc(cc1Cl)C1(CN2CCOCC2)CCCCC1