Reaction Details
TargetSodium-dependent noradrenaline transporter
LigandBDBM50337916
Substrate/Competitorn/a
Meas. Tech.ChEMBL_726960 (CHEMBL1686749)
IC50 960±n/a nM
Citation Shao, LHewitt, MCWang, FMalcolm, SCMa, JCampbell, JECampbell, UCEngel, SRSpicer, NAHardy, LWSchreiber, RSpear, KLVarney, MA Discovery of N-methyl-1-(1-phenylcyclohexyl)ethanamine, a novel triple serotonin, norepinephrine and dopamine reuptake inhibitor. Bioorg Med Chem Lett21:1434-7 (2011) 
 
Sodium-dependent noradrenaline transporter
Name:Sodium-dependent noradrenaline transporter
Type:Multi-pass membrane protein
Mol. Mass.:69337.72
Organism:Homo sapiens (Human)
Description:P23975
Residue:617
BDBM50337916
NameBDBM50337916
Synonyms:(+/-)-1-(1-(3,4-dichlorophenyl)cyclohexyl)-N,3-dimethylbutan-1-amine US10562878, Compound 45
TypeSmall organic molecule
Emp. Form.C18H27Cl2N
Mol. Mass.328.32
SMILESCNC(CC(C)C)C1(CCCCC1)c1ccc(Cl)c(Cl)c1