Reaction Details
TargetSodium-dependent noradrenaline transporter
LigandBDBM50337903
Substrate/Competitorn/a
Meas. Tech.ChEMBL_726960 (CHEMBL1686749)
IC50 4000±n/a nM
Citation Shao, LHewitt, MCWang, FMalcolm, SCMa, JCampbell, JECampbell, UCEngel, SRSpicer, NAHardy, LWSchreiber, RSpear, KLVarney, MA Discovery of N-methyl-1-(1-phenylcyclohexyl)ethanamine, a novel triple serotonin, norepinephrine and dopamine reuptake inhibitor. Bioorg Med Chem Lett21:1434-7 (2011) 
 
Sodium-dependent noradrenaline transporter
Name:Sodium-dependent noradrenaline transporter
Type:Multi-pass membrane protein
Mol. Mass.:69337.72
Organism:Homo sapiens (Human)
Description:P23975
Residue:617
BDBM50337903
NameBDBM50337903
Synonyms:1-(1-(naphthalen-1-yl)cyclohexyl)ethanamine US10562878, Compound 16 E2
TypeSmall organic molecule
Emp. Form.C18H23N
Mol. Mass.253.3819
SMILESCC(N)C1(CCCCC1)c1cccc2ccccc12