Reaction Details
TargetSodium-dependent serotonin transporter
LigandBDBM50337838
Substrate/Competitorn/a
Meas. Tech.ChEMBL_726959 (CHEMBL1686748)
IC50 169±n/a nM
Citation Shao, LHewitt, MCWang, FMalcolm, SCMa, JCampbell, JECampbell, UCEngel, SRSpicer, NAHardy, LWSchreiber, RSpear, KLVarney, MA Discovery of N-methyl-1-(1-phenylcyclohexyl)ethanamine, a novel triple serotonin, norepinephrine and dopamine reuptake inhibitor. Bioorg Med Chem Lett21:1434-7 (2011) 
 
Sodium-dependent serotonin transporter
Name:Sodium-dependent serotonin transporter
Type:Multi-pass membrane protein
Mol. Mass.:70322.51
Organism:Homo sapiens (Human)
Description:P31645
Residue:630
BDBM50337838
NameBDBM50337838
Synonyms:1-(1-(3,4-dichlorophenyl)cyclohexyl)-N-methylmethanamine US10562878, Compound 75
TypeSmall organic molecule
Emp. Form.C14H19Cl2N
Mol. Mass.272.213
SMILESCNCC1(CCCCC1)c1ccc(Cl)c(Cl)c1