Reaction Details
TargetSodium-dependent noradrenaline transporter
LigandBDBM50337913
Substrate/Competitorn/a
Meas. Tech.ChEMBL_726960 (CHEMBL1686749)
IC50 21.0±n/a nM
Citation Shao, LHewitt, MCWang, FMalcolm, SCMa, JCampbell, JECampbell, UCEngel, SRSpicer, NAHardy, LWSchreiber, RSpear, KLVarney, MA Discovery of N-methyl-1-(1-phenylcyclohexyl)ethanamine, a novel triple serotonin, norepinephrine and dopamine reuptake inhibitor. Bioorg Med Chem Lett21:1434-7 (2011) 
 
Sodium-dependent noradrenaline transporter
Name:Sodium-dependent noradrenaline transporter
Type:Multi-pass membrane protein
Mol. Mass.:69337.72
Organism:Homo sapiens (Human)
Description:P23975
Residue:617
BDBM50337913
NameBDBM50337913
Synonyms:(+/-)-N,N-dimethyl-1-(1-(naphthalen-2-yl)cyclohexyl)ethanamine CHEMBL1684059 US10562878, Compound 55
TypeSmall organic molecule
Emp. Form.C20H27N
Mol. Mass.281.4351
SMILESCC(N(C)C)C1(CCCCC1)c1ccc2ccccc2c1