Reaction Details
TargetSodium-dependent dopamine transporter
LigandBDBM50337905
Substrate/Competitorn/a
Meas. Tech.ChEMBL_726961 (CHEMBL1686821)
IC50 2300±n/a nM
Citation Shao, LHewitt, MCWang, FMalcolm, SCMa, JCampbell, JECampbell, UCEngel, SRSpicer, NAHardy, LWSchreiber, RSpear, KLVarney, MA Discovery of N-methyl-1-(1-phenylcyclohexyl)ethanamine, a novel triple serotonin, norepinephrine and dopamine reuptake inhibitor. Bioorg Med Chem Lett21:1434-7 (2011) 
 
Sodium-dependent dopamine transporter
Name:Sodium-dependent dopamine transporter
Type:Multi-pass membrane protein
Mol. Mass.:68497.11
Organism:Homo sapiens (Human)
Description:Q01959
Residue:620
BDBM50337905
NameBDBM50337905
Synonyms:1-(1-(4-(trifluoromethoxy)phenyl)cyclohexyl)ethanamine US10562878, Compound 19 E2
TypeSmall organic molecule
Emp. Form.C15H20F3NO
Mol. Mass.287.3206
SMILESCC(N)C1(CCCCC1)c1ccc(OC(F)(F)F)cc1