Reaction Details
TargetSodium-dependent dopamine transporter
LigandBDBM50337906
Substrate/Competitorn/a
Meas. Tech.ChEMBL_726961 (CHEMBL1686821)
IC50 1520±n/a nM
Citation Shao, LHewitt, MCWang, FMalcolm, SCMa, JCampbell, JECampbell, UCEngel, SRSpicer, NAHardy, LWSchreiber, RSpear, KLVarney, MA Discovery of N-methyl-1-(1-phenylcyclohexyl)ethanamine, a novel triple serotonin, norepinephrine and dopamine reuptake inhibitor. Bioorg Med Chem Lett21:1434-7 (2011) 
 
Sodium-dependent dopamine transporter
Name:Sodium-dependent dopamine transporter
Type:Multi-pass membrane protein
Mol. Mass.:68497.11
Organism:Homo sapiens (Human)
Description:Q01959
Residue:620
BDBM50337906
NameBDBM50337906
Synonyms:1-(1-(4-tert-butoxyphenyl)cyclohexyl)ethanamine | CHEMBL1684052
TypeSmall organic molecule
Emp. Form.C18H29NO
Mol. Mass.275.429
SMILESCC(N)C1(CCCCC1)c1ccc(OC(C)(C)C)cc1