Reaction Details
TargetSodium-dependent dopamine transporter
LigandBDBM50337907
Substrate/Competitorn/a
Meas. Tech.ChEMBL_726961 (CHEMBL1686821)
IC50 1000±n/a nM
Citation Shao, LHewitt, MCWang, FMalcolm, SCMa, JCampbell, JECampbell, UCEngel, SRSpicer, NAHardy, LWSchreiber, RSpear, KLVarney, MA Discovery of N-methyl-1-(1-phenylcyclohexyl)ethanamine, a novel triple serotonin, norepinephrine and dopamine reuptake inhibitor. Bioorg Med Chem Lett21:1434-7 (2011) 
 
Sodium-dependent dopamine transporter
Name:Sodium-dependent dopamine transporter
Type:Multi-pass membrane protein
Mol. Mass.:68497.11
Organism:Homo sapiens (Human)
Description:Q01959
Residue:620
BDBM50337907
NameBDBM50337907
Synonyms:1-(1-(thiophen-2-yl)cyclohexyl)ethanamine US10562878, Compound 6
TypeSmall organic molecule
Emp. Form.C12H19NS
Mol. Mass.209.351
SMILESCC(N)C1(CCCCC1)c1cccs1