Reaction Details
TargetSodium-dependent dopamine transporter
LigandBDBM50337913
Substrate/Competitorn/a
Meas. Tech.ChEMBL_726961 (CHEMBL1686821)
IC50 72±n/a nM
Citation Shao, LHewitt, MCWang, FMalcolm, SCMa, JCampbell, JECampbell, UCEngel, SRSpicer, NAHardy, LWSchreiber, RSpear, KLVarney, MA Discovery of N-methyl-1-(1-phenylcyclohexyl)ethanamine, a novel triple serotonin, norepinephrine and dopamine reuptake inhibitor. Bioorg Med Chem Lett21:1434-7 (2011) 
 
Sodium-dependent dopamine transporter
Name:Sodium-dependent dopamine transporter
Type:Multi-pass membrane protein
Mol. Mass.:68497.11
Organism:Homo sapiens (Human)
Description:Q01959
Residue:620
BDBM50337913
NameBDBM50337913
Synonyms:(+/-)-N,N-dimethyl-1-(1-(naphthalen-2-yl)cyclohexyl)ethanamine CHEMBL1684059 US10562878, Compound 55
TypeSmall organic molecule
Emp. Form.C20H27N
Mol. Mass.281.4351
SMILESCC(N(C)C)C1(CCCCC1)c1ccc2ccccc2c1