Reaction Details
TargetSodium-dependent dopamine transporter
LigandBDBM50337910
Substrate/Competitorn/a
Meas. Tech.ChEMBL_726961 (CHEMBL1686821)
IC50 86.0±n/a nM
Citation Shao, LHewitt, MCWang, FMalcolm, SCMa, JCampbell, JECampbell, UCEngel, SRSpicer, NAHardy, LWSchreiber, RSpear, KLVarney, MA Discovery of N-methyl-1-(1-phenylcyclohexyl)ethanamine, a novel triple serotonin, norepinephrine and dopamine reuptake inhibitor. Bioorg Med Chem Lett21:1434-7 (2011) 
 
Sodium-dependent dopamine transporter
Name:Sodium-dependent dopamine transporter
Type:Multi-pass membrane protein
Mol. Mass.:68497.11
Organism:Homo sapiens (Human)
Description:Q01959
Residue:620
BDBM50337910
NameBDBM50337910
Synonyms:(+/-)-1-(1-(3,4-dichlorophenyl)cyclohexyl)-N-methylethanamine CHEMBL1684045 US10562878, Compound 108
TypeSmall organic molecule
Emp. Form.C15H21Cl2N
Mol. Mass.286.24
SMILESCNC(C)C1(CCCCC1)c1ccc(Cl)c(Cl)c1