Reaction Details
TargetPotassium voltage-gated channel subfamily H member 2
LigandBDBM50337911
Substrate/Competitorn/a
Meas. Tech.ChEMBL_726964 (CHEMBL1686824)
IC50 40000±n/a nM
Citation Shao, LHewitt, MCWang, FMalcolm, SCMa, JCampbell, JECampbell, UCEngel, SRSpicer, NAHardy, LWSchreiber, RSpear, KLVarney, MA Discovery of N-methyl-1-(1-phenylcyclohexyl)ethanamine, a novel triple serotonin, norepinephrine and dopamine reuptake inhibitor. Bioorg Med Chem Lett21:1434-7 (2011) 
 
Potassium voltage-gated channel subfamily H member 2
Name:Potassium voltage-gated channel subfamily H member 2
Type:Multi-pass membrane protein
Mol. Mass.:126672.65
Organism:Homo sapiens (Human)
Description:Q12809
Residue:1159
BDBM50337911
NameBDBM50337911
Synonyms:(+/-)-1-(1-(3,4-dichlorophenyl)cyclohexyl)-N,N-dimethylethanamine CHEMBL1684047 US10562878, Compound 43
TypeSmall organic molecule
Emp. Form.C16H23Cl2N
Mol. Mass.300.267
SMILESCC(N(C)C)C1(CCCCC1)c1ccc(Cl)c(Cl)c1