Reaction Details
TargetDual specificity mitogen-activated protein kinase kinase 1
LigandBDBM50337932
Substrate/Competitorn/a
Meas. Tech.ChEMBL_726976 (CHEMBL1686836)
IC50 4±n/a nM
Citation Dong, QDougan, DRGong, XHalkowycz, PJin, BKanouni, TO'Connell, SMScorah, NShi, LWallace, MBZhou, F Discovery of TAK-733, a potent and selective MEK allosteric site inhibitor for the treatment of cancer. Bioorg Med Chem Lett21:1315-9 (2011) 
 
Dual specificity mitogen-activated protein kinase kinase 1
Name:Dual specificity mitogen-activated protein kinase kinase 1
Type:Other Protein Type
Mol. Mass.:43439.03
Organism:Homo sapiens (Human)
Description:Full-length human MEK-1 was generated by PCR and purified as a fusion protein from Escherichia coli lysates.
Residue:393
BDBM50337932
NameBDBM50337932
Synonyms:5-(2-fluoro-4-iodophenylamino)-3-(2-hydroxyethyl)-6,8-dimethylpyrido[2,3-d]pyrimidine-4,7(3H,8H)-dione US8470837, 14
TypeSmall organic molecule
Emp. Form.C17H16FIN4O3
Mol. Mass.470.2368
SMILESCc1c(Nc2ccc(I)cc2F)c2c(ncn(CCO)c2=O)n(C)c1=O