Reaction Details
TargetGlucocorticoid receptor
LigandBDBM50338312
Substrate/Competitorn/a
Meas. Tech.ChEMBL_728109 (CHEMBL1687051)
EC50 9.6±n/a nM
Citation Hudson, ARHiguchi, RIRoach, SLAdams, MEVassar, ASyka, PMMais, DEMiner, JNMarschke, KBZhi, L Discovery of orally available tetrahydroquinoline-based glucocorticoid receptor agonists. Bioorg Med Chem Lett21:1697-700 (2011) 
 
Glucocorticoid receptor
Name:Glucocorticoid receptor
Type:Enzyme
Mol. Mass.:85656.87
Organism:Homo sapiens (Human)
Description:P04150
Residue:777
BDBM50338312
NameBDBM50338312
Synonyms:(+/-)-(3R,4S)-3-hydroxy-6-(1H-indol-7-yl)-2,2,4,8-tetramethyl-1,2,3,4-tetrahydroquinoline-5-carbonitrile | CHEMBL1682429
TypeSmall organic molecule
Emp. Form.C22H23N3O
Mol. Mass.345.4375
SMILESC[C@@H]1[C@@H](O)C(C)(C)Nc2c(C)cc(-c3cccc4cc[nH]c34)c(C#N)c12