Reaction Details
TargetGlucocorticoid receptor
LigandBDBM50338321
Substrate/Competitorn/a
Meas. Tech.ChEMBL_728108 (CHEMBL1687050)
Ki 1.2±n/a nM
Citation Hudson, ARHiguchi, RIRoach, SLAdams, MEVassar, ASyka, PMMais, DEMiner, JNMarschke, KBZhi, L Discovery of orally available tetrahydroquinoline-based glucocorticoid receptor agonists. Bioorg Med Chem Lett21:1697-700 (2011) 
 
Glucocorticoid receptor
Name:Glucocorticoid receptor
Type:Enzyme
Mol. Mass.:85656.87
Organism:Homo sapiens (Human)
Description:P04150
Residue:777
BDBM50338321
NameBDBM50338321
Synonyms:(+/-)-(3R,4S)-6-(1H-indol-7-yl)-2,2,4,5,8-pentamethyl-1,2,3,4-tetrahydroquinolin-3-ol | CHEMBL1682420
TypeSmall organic molecule
Emp. Form.C22H26N2O
Mol. Mass.334.4546
SMILESC[C@@H]1[C@@H](O)C(C)(C)Nc2c(C)cc(c(C)c12)-c1cccc2cc[nH]c12